Target
Epoxide hydrolase 1
Ligand
BDBM409008
Substrate
Meas. Tech.
Inhibitors of Soluble Epoxide Hydrolase (sEH)
Ki
0.750±0.05 nM
Citation
 Chiamvimonvat, NHammock, BDSirish, P Methods of improving cell-based therapy US Patent  US11723929 Publication Date 8/15/2023 
Target
Name:
Epoxide hydrolase 1
Synonyms:
EPHX EPOX Epoxide hydrolase (HsEH) HYEP_HUMAN | Microsomal epoxide hydrolase
Type:
Protein
Mol. Mass.:
52954.28
Organism:
Homo sapiens (Human)
Description:
P07099
Residue:
455
  
Inhibitor
Name:
BDBM409008
Synonyms:
US10377744, Compound No. 29 US11723929, Compound 29
Type:
Small organic molecule
Emp. Form.:
C19H23F4N3O4
Mol. Mass.:
433.3972
SMILES:
Fc1cc(NC(=O)NC2CCN(CC2)C(=O)C2CCOCC2)ccc1OC(F)(F)F
: