Target
Epoxide hydrolase 1
Ligand
BDBM409014
Substrate
Meas. Tech.
Inhibitors of Soluble Epoxide Hydrolase (sEH)
Ki
0.370±0.03 nM
Citation
 Chiamvimonvat, NHammock, BDSirish, P Methods of improving cell-based therapy US Patent  US11723929 Publication Date 8/15/2023 
Target
Name:
Epoxide hydrolase 1
Synonyms:
EPHX EPOX Epoxide hydrolase (HsEH) HYEP_HUMAN | Microsomal epoxide hydrolase
Type:
Protein
Mol. Mass.:
52954.28
Organism:
Homo sapiens (Human)
Description:
P07099
Residue:
455
  
Inhibitor
Name:
BDBM409014
Synonyms:
US10377744, Compound No. 34 US11123311, Compound 34 | US11723929, Compound 34
Type:
Small organic molecule
Emp. Form.:
C18H23F4N3O2
Mol. Mass.:
389.3877
SMILES:
CC[C@H](C)C(=O)N1CCC(CC1)NC(=O)Nc1ccc(c(F)c1)C(F)(F)F
: