Target
Epoxide hydrolase 1
Ligand
BDBM409015
Substrate
Meas. Tech.
Inhibitors of Soluble Epoxide Hydrolase (sEH)
Ki
2.66±0.19 nM
Citation
 Chiamvimonvat, NHammock, BDSirish, P Methods of improving cell-based therapy US Patent  US11723929 Publication Date 8/15/2023 
Target
Name:
Epoxide hydrolase 1
Synonyms:
EPHX EPOX Epoxide hydrolase (HsEH) HYEP_HUMAN | Microsomal epoxide hydrolase
Type:
Protein
Mol. Mass.:
52954.28
Organism:
Homo sapiens (Human)
Description:
P07099
Residue:
455
  
Inhibitor
Name:
BDBM409015
Synonyms:
US10377744, Compound No. 35 US11723929, Compound 35
Type:
Small organic molecule
Emp. Form.:
C19H23F4N3O3
Mol. Mass.:
417.3978
SMILES:
Fc1cc(NC(=O)NC2CCN(CC2)C(=O)C2CCCOC2)ccc1C(F)(F)F
: