Target
Epoxide hydrolase 1
Ligand
BDBM409019
Substrate
Meas. Tech.
Inhibitors of Soluble Epoxide Hydrolase (sEH)
Ki
10.1±1.8 nM
Citation
 Chiamvimonvat, NHammock, BDSirish, P Methods of improving cell-based therapy US Patent  US11723929 Publication Date 8/15/2023 
Target
Name:
Epoxide hydrolase 1
Synonyms:
EPHX EPOX Epoxide hydrolase (HsEH) HYEP_HUMAN | Microsomal epoxide hydrolase
Type:
Protein
Mol. Mass.:
52954.28
Organism:
Homo sapiens (Human)
Description:
P07099
Residue:
455
  
Inhibitor
Name:
BDBM409019
Synonyms:
US10377744, Compound No. 39 US11723929, Compound 39
Type:
Small organic molecule
Emp. Form.:
C27H28F8N6O5
Mol. Mass.:
668.5356
SMILES:
Fc1cc(NC(=O)NC2CCN(CC2)C(=O)N2CCC(CC2)NC(=O)Nc2ccc(OC(F)(F)F)c(F)c2)ccc1OC(F)(F)F
: