Target
Epoxide hydrolase 1
Ligand
BDBM409027
Substrate
Meas. Tech.
Inhibitors of Soluble Epoxide Hydrolase (sEH)
Ki
9.07±0.36 nM
Citation
 Chiamvimonvat, NHammock, BDSirish, P Methods of improving cell-based therapy US Patent  US11723929 Publication Date 8/15/2023 
Target
Name:
Epoxide hydrolase 1
Synonyms:
EPHX EPOX Epoxide hydrolase (HsEH) HYEP_HUMAN | Microsomal epoxide hydrolase
Type:
Protein
Mol. Mass.:
52954.28
Organism:
Homo sapiens (Human)
Description:
P07099
Residue:
455
  
Inhibitor
Name:
BDBM409027
Synonyms:
US10377744, Compound No. 47 US11723929, Compound 47
Type:
Small organic molecule
Emp. Form.:
C19H23F6N3O4
Mol. Mass.:
471.394
SMILES:
CC[C@H](C)C(=O)N1CCC(CC1)NC(=O)Nc1ccc(OC(F)(F)F)c(OC(F)(F)F)c1
: