Target
Epoxide hydrolase 1
Ligand
BDBM409029
Substrate
Meas. Tech.
Inhibitors of Soluble Epoxide Hydrolase (sEH)
Ki
3.14±0.70 nM
Citation
 Chiamvimonvat, NHammock, BDSirish, P Methods of improving cell-based therapy US Patent  US11723929 Publication Date 8/15/2023 
Target
Name:
Epoxide hydrolase 1
Synonyms:
EPHX EPOX Epoxide hydrolase (HsEH) HYEP_HUMAN | Microsomal epoxide hydrolase
Type:
Protein
Mol. Mass.:
52954.28
Organism:
Homo sapiens (Human)
Description:
P07099
Residue:
455
  
Inhibitor
Name:
BDBM409029
Synonyms:
US10377744, Compound No. 49 US11723929, Compound 49
Type:
Small organic molecule
Emp. Form.:
C19H24F4N2O3
Mol. Mass.:
404.3991
SMILES:
CC[C@H](C)C(=O)N1CCC(CC(=O)Nc2ccc(OC(F)(F)F)c(F)c2)CC1
: