Target
Serine/threonine-protein kinase SIK2
Ligand
BDBM192714
Substrate
Meas. Tech.
SIK2 Kinase Activity Assay
IC50
6.00±3 nM
Citation
 Gray, NSLiang, YChoi, HGSundberg, TShamji, AXavier, RFisher, DEMujahid, N Bicyclic urea kinase inhibitors and uses thereof US Patent  US11725011 Publication Date 8/15/2023 
Target
Name:
Serine/threonine-protein kinase SIK2
Synonyms:
KIAA0781 SIK2 SNF1LK2 Serine/threonine-protein kinase SIK2
Type:
Protein
Mol. Mass.:
103906.53
Organism:
Homo sapiens (Human)
Description:
Residue:
926
  
Inhibitor
Name:
BDBM192714
Synonyms:
US11725011, Compound YKL-05-95 | YKL-05-095 (3)
Type:
Small organic molecule
Emp. Form.:
C30H31ClN8O2
Mol. Mass.:
571.073
SMILES:
COc1ccc(nc1)N1C(=O)N(Cc2cnc(Nc3ccc(cc3)N3CCN(C)CC3)nc12)c1c(C)cccc1Cl
: