Target
Lysine-specific demethylase 4C
Ligand
BDBM270534
Substrate
Meas. Tech.
In Vitro Enzyme Inhibition Assay for JMJD2C Activity
IC50
550±n/a nM
Citation
 Chen, YKWallace, MB Histone demethylase inhibitors US Patent  US11731954 Publication Date 8/22/2023 
Target
Name:
Lysine-specific demethylase 4C
Synonyms:
GASC-1 protein Gene amplified in squamous cell carcinoma 1 protein JMJD2C Jumonji domain-containing protein 2C KDM4C_HUMAN | KIAA0780
Type:
Protein
Mol. Mass.:
119979.01
Organism:
Homo sapiens (Human)
Description:
Q9H3R0
Residue:
1056
  
Inhibitor
Name:
BDBM270534
Synonyms:
(R)-3-(((2-methyl-5-(o-tolyl)isoindolin-1-yl)methyl)amino) isonicotinic acid US11001568, Example 21A | US11731954, Example 21A and 21B
Type:
Small organic molecule
Emp. Form.:
C23H23N3O2
Mol. Mass.:
373.4476
SMILES:
CN1Cc2cc(ccc2[C@@H]1CNc1cnccc1C(O)=O)-c1ccccc1C
: