Target
Flavin reductase (NADPH)
Ligand
BDBM79514
Substrate
Meas. Tech.
Enzyme Activity Assay
Kd
160±30 nM
Citation
 Ryu, KKim, MGriesinger, CLee, D Method of increasing platelet counts of a subject US Patent  US11744839 Publication Date 9/5/2023 
Target
Name:
Flavin reductase (NADPH)
Synonyms:
1.3.1.24 BLVRB BVR-B Biliverdin-IX beta-reductase | FLR
Type:
PROTEIN
Mol. Mass.:
22123.63
Organism:
Homo sapiens
Description:
ChEMBL_100283
Residue:
206
  
Inhibitor
Name:
BDBM79514
Synonyms:
Erythrosin B SMR000875321 cid_25162930 sodium;2-(2,4,5,7-tetraiodo-3-oxido-6-oxo-9-xanthenyl)benzoate sodium;2-[2,4,5,7-tetrakis(iodanyl)-3-oxidanidyl-6-oxidanylidene-xanthen-9-yl]benzoate
Type:
Small organic molecule
Emp. Form.:
C20H6I4O5
Mol. Mass.:
833.8776
SMILES:
[O-]C(=O)c1ccccc1-c1c2cc(I)c([O-])c(I)c2oc2c(I)c(=O)c(I)cc12
: