Target
Flavin reductase (NADPH)
Ligand
BDBM50201618
Substrate
Meas. Tech.
Enzyme Activity Assay
Kd
270±30 nM
Citation
 Ryu, KKim, MGriesinger, CLee, D Method of increasing platelet counts of a subject US Patent  US11744839 Publication Date 9/5/2023 
Target
Name:
Flavin reductase (NADPH)
Synonyms:
1.3.1.24 BLVRB BVR-B Biliverdin-IX beta-reductase | FLR
Type:
PROTEIN
Mol. Mass.:
22123.63
Organism:
Homo sapiens
Description:
ChEMBL_100283
Residue:
206
  
Inhibitor
Name:
BDBM50201618
Synonyms:
CHEBI:76138 SCH-14714 | US11744839, Compound of formula 7
Type:
Small organic molecule
Emp. Form.:
C14H11F3N2O2
Mol. Mass.:
296.2445
SMILES:
Cc1c(Nc2ncccc2C(O)=O)cccc1C(F)(F)F
: