Target
Glycogen synthase kinase-3 beta
Ligand
BDBM293423
Substrate
Meas. Tech.
GSK3β Kinase Assay
EC50
3198±n/a nM
Citation
 KC, SKMak, CCEastman, BWCao, JBollu, VMittapalli, GKChiruta, C ISOQUINOLIN-3-YL CARBOXAMIDES AND PREPARATION AND USE THEREOF US Patent  US20230286945 Publication Date 9/14/2023 
Target
Name:
Glycogen synthase kinase-3 beta
Synonyms:
GSK-3 beta GSK3B Glycogen synthase kinase 3 beta (GSK3B) Glycogen synthase kinase-3 beta (GSK-3B) Glycogen synthase kinase-3 beta (GSK3B) Glycogen synthase kinase-3beta (GSK3B) | Serine/threonine-protein kinase GSK3B
Type:
Enzyme
Mol. Mass.:
46756.38
Organism:
Homo sapiens (Human)
Description:
P49841
Residue:
420
  
Inhibitor
Name:
BDBM293423
Synonyms:
US10106527, Compound 461 US10544128, Compound 9 US20230286945, Compound 461 | US9951048, Compound 461
Type:
Small organic molecule
Emp. Form.:
C23H23N7O
Mol. Mass.:
413.475
SMILES:
Cn1cc(cn1)-c1ccc2cnc(NC(=O)c3ccnc(c3)N3CCNCC3)cc2c1
: