Target
Adenosine receptor A2b
Ligand
BDBM618870
Substrate
Meas. Tech.
Adenosine Receptor Time-Resolved Fluorescence Resonance Energy Transfer (TRFRET) Binding Assay
Ki
0.600±n/a nM
Citation
 McCarthy, CMoulton, BWalker, ERMcMahon, PS ANTAGONIST COMPOUNDS US Patent  US20230293517 Publication Date 9/21/2023 
Target
Name:
Adenosine receptor A2b
Synonyms:
AA2BR_HUMAN ADORA2B Adenosine receptors A2b | Adenosine receptors; A2a & A2b
Type:
G Protein-Coupled Receptor (GPCR)
Mol. Mass.:
36341.22
Organism:
Homo sapiens (Human)
Description:
Residue:
332
  
Inhibitor
Name:
BDBM618870
Synonyms:
US20230293517, Example 6.100
Type:
Small organic molecule
Emp. Form.:
C22H18ClN5O2S
Mol. Mass.:
451.929
SMILES:
Cc1cc(cc(Cl)n1)-c1sc(NC(=O)N2CC3(COC3)C2)nc1-c1cccc(c1)C#N
: