Target
fMet-Leu-Phe receptor
Ligand
BDBM620557
Substrate
Meas. Tech.
cAMP Assay
EC50
0.000±n/a nM
Citation
 Shirude, PSRachamreddy, CRBaligar, VSeshadri, BMadduri, SRKick, EKWurtz, NR OXOPYRROLIDINE UREA FPR2 AGONISTS US Patent  US20230303513 Publication Date 9/28/2023 
Target
Name:
fMet-Leu-Phe receptor
Synonyms:
FPR FPR1_HUMAN N-formyl peptide receptor 1 fMLP receptor formyl peptide receptor 1
Type:
Enzyme Catalytic Domain
Mol. Mass.:
38456.14
Organism:
Homo sapiens (Human)
Description:
gi_4503779
Residue:
350
  
Inhibitor
Name:
BDBM620557
Synonyms:
US20230303513, Example 16 | US20230303513, Example 5
Type:
Small organic molecule
Emp. Form.:
C30H33ClN4O5
Mol. Mass.:
565.06
SMILES:
COCCn1cccc(N2C[C@H]([C@H](NC(=O)NC3CCc4cc(Cl)ccc4C3)C2=O)c2ccc(OC)cc2)c1=O
: