Target
fMet-Leu-Phe receptor
Ligand
BDBM620562
Substrate
Meas. Tech.
cAMP Assay
EC50
0.500±n/a nM
Citation
 Shirude, PSRachamreddy, CRBaligar, VSeshadri, BMadduri, SRKick, EKWurtz, NR OXOPYRROLIDINE UREA FPR2 AGONISTS US Patent  US20230303513 Publication Date 9/28/2023 
Target
Name:
fMet-Leu-Phe receptor
Synonyms:
FPR FPR1_HUMAN N-formyl peptide receptor 1 fMLP receptor formyl peptide receptor 1
Type:
Enzyme Catalytic Domain
Mol. Mass.:
38456.14
Organism:
Homo sapiens (Human)
Description:
gi_4503779
Residue:
350
  
Inhibitor
Name:
BDBM620562
Synonyms:
US20230303513, Example 10 US20230303513, Example 43
Type:
Small organic molecule
Emp. Form.:
C28H24ClF5N4O3
Mol. Mass.:
594.96
SMILES:
COc1cc(F)c([C@@H]2CN(C(=O)[C@H]2NC(=O)NC2CCc3cc(Cl)ccc3C2)c2ncccc2C(F)(F)F)c(F)c1
: