Target
fMet-Leu-Phe receptor
Ligand
BDBM620593
Substrate
Meas. Tech.
cAMP Assay
EC50
0.300±n/a nM
Citation
 Shirude, PSRachamreddy, CRBaligar, VSeshadri, BMadduri, SRKick, EKWurtz, NR OXOPYRROLIDINE UREA FPR2 AGONISTS US Patent  US20230303513 Publication Date 9/28/2023 
Target
Name:
fMet-Leu-Phe receptor
Synonyms:
FPR FPR1_HUMAN N-formyl peptide receptor 1 fMLP receptor formyl peptide receptor 1
Type:
Enzyme Catalytic Domain
Mol. Mass.:
38456.14
Organism:
Homo sapiens (Human)
Description:
gi_4503779
Residue:
350
  
Inhibitor
Name:
BDBM620593
Synonyms:
US20230303513, Example 34 | US20230303513, Example 53
Type:
Small organic molecule
Emp. Form.:
C31H34F2N4O6
Mol. Mass.:
596.6217
SMILES:
COCCn1cccc(N2C[C@H]([C@H](NC(=O)NC3CCc4cc(OC)ccc4C3)C2=O)c2c(F)cc(OC)cc2F)c1=O
: