Target
Toll-like receptor 8
Ligand
BDBM621054
Substrate
Meas. Tech.
In Vitro Receptor Binding Activity of Human Toll-Like Receptor 7 (TLR7) and Human Toll-Like Receptor 8 (TLR8)
EC50
3±0 nM
Citation
 CAI, ZSUN, FDing, CZCHEN, S CRYSTALLINE FORM OF TLR8 AGONIST US Patent  US20230303557 Publication Date 9/28/2023 
Target
Name:
Toll-like receptor 8
Synonyms:
CD_antigen: CD288 TLR8_HUMAN | TRL8
Type:
Enzyme
Mol. Mass.:
119828.77
Organism:
Homo sapiens (Human)
Description:
Q9NR97
Residue:
1041
  
Inhibitor
Name:
BDBM621054
Synonyms:
US20230303557, Example formula (I)
Type:
Small organic molecule
Emp. Form.:
C16H22N8
Mol. Mass.:
326.3995
SMILES:
CCCC[C@](C)(Cc1ncn[nH]1)Nc1nc(N)nc2cnccc12
: