Target
Receptor-type tyrosine-protein kinase FLT3 [D835H]
Ligand
BDBM621115
Substrate
Meas. Tech.
Kinase Binding Assay
Kd
0.038±n/a nM
Citation
 HOYT, SBTHOMAS, CJFINOCCHIO, CJSTARCZYNOWSKI, DTTAWA, GJGRACIA MALDONADO, GROSEBAUM, JS MULTI-CYCLIC IRAK AND FLT3 INHIBITING COMPOUNDS AND USES THEREOF US Patent  US20230303563 Publication Date 9/28/2023 
Target
Name:
Receptor-type tyrosine-protein kinase FLT3 [D835H]
Synonyms:
CD135 FLK2 FLT3(D835H) Receptor-type tyrosine-protein kinase FLT3 (D835H) STK1 Tyrosine Kinase FLT3 Mutant (D835H)
Type:
Mol. Mass.:
112912.18
Organism:
Homo sapiens (Human)
Description:
P36888 D835H
Residue:
993
  
Inhibitor
Name:
BDBM621115
Synonyms:
US20230303563, Compound 117
Type:
Small organic molecule
Emp. Form.:
C20H22FN5O
Mol. Mass.:
367.42
SMILES:
OCc1cc2ncc(-c3cccc(N[C@H]4CNC[C@@H]4F)n3)n2cc1C1CC1
: