Target
Receptor-type tyrosine-protein kinase FLT3 [D835H]
Ligand
BDBM621116
Substrate
Meas. Tech.
Kinase Binding Assay
Kd
0.180±n/a nM
Citation
 HOYT, SBTHOMAS, CJFINOCCHIO, CJSTARCZYNOWSKI, DTTAWA, GJGRACIA MALDONADO, GROSEBAUM, JS MULTI-CYCLIC IRAK AND FLT3 INHIBITING COMPOUNDS AND USES THEREOF US Patent  US20230303563 Publication Date 9/28/2023 
Target
Name:
Receptor-type tyrosine-protein kinase FLT3 [D835H]
Synonyms:
CD135 FLK2 FLT3(D835H) Receptor-type tyrosine-protein kinase FLT3 (D835H) STK1 Tyrosine Kinase FLT3 Mutant (D835H)
Type:
Mol. Mass.:
112912.18
Organism:
Homo sapiens (Human)
Description:
P36888 D835H
Residue:
993
  
Inhibitor
Name:
BDBM621116
Synonyms:
2-(3-(6-(((3S,4S)-4- fluoropyrrolidin-3- yl)amino)pyridin-2-yl)-7- methoxyimidazo[1,2- a]pyridin-6-yl)propan-2-ol | US20230303563, Compound 137
Type:
Small organic molecule
Emp. Form.:
C20H24FN5O2
Mol. Mass.:
385.4353
SMILES:
CC(C)(O)c1cn2c(cnc2cc1CO)-c1cccc(N[C@H]2CNC[C@@H]2F)n1
: