Target
Receptor-type tyrosine-protein kinase FLT3 [D835H]
Ligand
BDBM621130
Substrate
Meas. Tech.
Kinase Binding Assay
Kd
0.780±n/a nM
Citation
 HOYT, SBTHOMAS, CJFINOCCHIO, CJSTARCZYNOWSKI, DTTAWA, GJGRACIA MALDONADO, GROSEBAUM, JS MULTI-CYCLIC IRAK AND FLT3 INHIBITING COMPOUNDS AND USES THEREOF US Patent  US20230303563 Publication Date 9/28/2023 
Target
Name:
Receptor-type tyrosine-protein kinase FLT3 [D835H]
Synonyms:
CD135 FLK2 FLT3(D835H) Receptor-type tyrosine-protein kinase FLT3 (D835H) STK1 Tyrosine Kinase FLT3 Mutant (D835H)
Type:
Mol. Mass.:
112912.18
Organism:
Homo sapiens (Human)
Description:
P36888 D835H
Residue:
993
  
Inhibitor
Name:
BDBM621130
Synonyms:
N-(6-(6- (difluoromethyl)imidazo[1,2- a]pyridin-3-yl)pyridin-2-yl)-2- azaspiro[3.4]octan-6-amine | US20230303563, Compound 181
Type:
Small organic molecule
Emp. Form.:
C20H21F2N5
Mol. Mass.:
369.411
SMILES:
FC(F)c1ccc2ncc(-c3cccc(NC4CCC5(CNC5)C4)n3)n2c1
: