Target
Cyclin-dependent kinase 4/G1/S-specific cyclin-D1
Ligand
BDBM621180
Substrate
Meas. Tech.
CDK4/CyclinD1 Enzyme Reaction System
IC50
0.500±n/a nM
Citation
 XU, ZJIANG, WHU, LDING, CZHU, GLI, JCHEN, SCHEN, PYAN, XLIU, Y PYRIMIDINE RING COMPOUND US Patent  US20230303564 Publication Date 9/28/2023 
Target
Name:
Cyclin-dependent kinase 4/G1/S-specific cyclin-D1
Synonyms:
CDK4/CycD CDK4/Cyclin D1 Cyclin-Dependent Kinase 4 (CDK4) Cyclin-dependent kinase 4/G1/S-specific cyclin D1 | Cyclin-dependent kinase 4/cyclin D1
Type:
Protein Complex
Mol. Mass.:
Description:
CDK4/D1 complexes were purified from insect cells co-infected with baculovirus vectors containing each of the components.
Components:
This complex has 2 components.
Component 1
Name:
Cyclin-dependent kinase 4
Synonyms:
CDK4 Cell division protein kinase 4 PSK-J3
Type:
Enzyme Subunit
Mol. Mass.:
33731.96
Organism:
Homo sapiens (Human)
Description:
P11802
Residue:
303
  
Component 2
Name:
G1/S-specific cyclin-D1
Synonyms:
B-cell lymphoma 1 protein BCL-1 oncogene CCND1 PRAD1 | PRAD1 oncogene
Type:
Enzyme Subunit
Mol. Mass.:
33717.70
Organism:
Homo sapiens (Human)
Description:
Residue:
295
  
Inhibitor
Name:
BDBM621180
Synonyms:
US20230303564, Compound 22
Type:
Small organic molecule
Emp. Form.:
C19H24F4N6O2S
Mol. Mass.:
476.491
SMILES:
CS(=O)(=O)N1CCC(CC1)Nc1ncc2cc(nc(N[C@@H]3CCCC3(F)F)c2n1)C(F)F
: