Target
2-amino-3-carboxymuconate-6-semialdehyde decarboxylase
Ligand
BDBM622873
Substrate
Meas. Tech.
Human ACMSD-1 Inhibitor Assay
IC50
9.00±n/a nM
Citation
 Takahashi, TJi, N Oxopyridine derivatives useful as aminocarboxymuconate semialdehyde decarboxylase (ACMSD) inhibitors US Patent  US11780812 Publication Date 10/10/2023 
Target
Name:
2-amino-3-carboxymuconate-6-semialdehyde decarboxylase
Synonyms:
ACMSD Picolinate carboxylase
Type:
Enzyme Catalytic Domain
Mol. Mass.:
38037.38
Organism:
Homo sapiens (Human)
Description:
Q8TDX5
Residue:
336
  
Inhibitor
Name:
BDBM622873
Synonyms:
US11780812, Ex. 27
Type:
Small organic molecule
Emp. Form.:
C9H4F4N2O3S
Mol. Mass.:
296.198
SMILES:
OC(=O)C(F)Sc1[nH]c(=O)cc(c1C#N)C(F)(F)F
: