Target
Replicase polyprotein 1ab
Ligand
BDBM71742
Substrate
Meas. Tech.
Chan-Lam
IC50
1700±n/a nM
Citation
Some error occurs, please report
Target
Name:
Replicase polyprotein 1ab
Synonyms:
ORF1ab polyprotein pp1ab | rep
Type:
Protein
Mol. Mass.:
794070.71
Organism:
2019-nCoV
Description:
P0DTD1
Residue:
7096
  
Inhibitor
Name:
BDBM71742
Synonyms:
7-amino-4-methyl-1-benzopyran-2-one 7-amino-4-methylchromen-2-one EN300-05587 SMR000067752 | cid_92249
Type:
Small organic molecule
Emp. Form.:
C10H9NO2
Mol. Mass.:
175.184
SMILES:
Cc1cc(=O)oc2cc(N)ccc12
: