Target
Alpha-2B adrenergic receptor
Ligand
BDBM625941
Substrate
Meas. Tech.
SPR Assay
IC50
4910±n/a nM
Citation
 Bell, ASSchreyer, AMVersluys, S Pyrazolopyrimidine compounds as adenosine receptor antagonists US Patent  US11786528 Publication Date 10/17/2023 
Target
Name:
Alpha-2B adrenergic receptor
Synonyms:
ADA2B_HUMAN ADRA2L1 Adrenergic alpha2B Adrenergic receptor alpha Alpha-2 adrenergic receptor subtype C2 Alpha-2B adrenoreceptor | Alpha-2BAR
Type:
Enzyme
Mol. Mass.:
49964.20
Organism:
Homo sapiens (Human)
Description:
P18089
Residue:
450
  
Inhibitor
Name:
BDBM625941
Synonyms:
US11786528, Comparative Example 1
Type:
Small organic molecule
Emp. Form.:
C18H17N5O2
Mol. Mass.:
335.3599
SMILES:
COc1ccccc1Cn1cc2c(N)nc(nc2n1)-c1ccc(C)o1
: