Target
Alpha-2B adrenergic receptor
Ligand
BDBM625944
Substrate
Meas. Tech.
SPR Assay
IC50
1500±n/a nM
Citation
 Bell, ASSchreyer, AMVersluys, S Pyrazolopyrimidine compounds as adenosine receptor antagonists US Patent  US11786528 Publication Date 10/17/2023 
Target
Name:
Alpha-2B adrenergic receptor
Synonyms:
ADA2B_HUMAN ADRA2L1 Adrenergic alpha2B Adrenergic receptor alpha Alpha-2 adrenergic receptor subtype C2 Alpha-2B adrenoreceptor | Alpha-2BAR
Type:
Enzyme
Mol. Mass.:
49964.20
Organism:
Homo sapiens (Human)
Description:
P18089
Residue:
450
  
Inhibitor
Name:
BDBM625944
Synonyms:
2-[(3-methylphenyl)methyl]-6-(1,2-thiazol-3-yl)-2H-pyrazolo[3,4-d]pyrimidin-4-amine | US11786528, Example 1
Type:
Small organic molecule
Emp. Form.:
C16H14N6S
Mol. Mass.:
322.388
SMILES:
Cc1cccc(Cn2cc3c(N)nc(nc3n2)-c2ccsn2)c1
: