Target
fMet-Leu-Phe receptor
Ligand
BDBM631915
Substrate
Meas. Tech.
FPR2 and FPR1 Cyclic Adenosine Monophosphate (cAMP) Assays
EC50
0.700±n/a nM
Citation
 Shirude, PSRachamreddy, CRChattopadhyay, AKSeshadri, BBaligar, VMadduri, SRKick, EKWurtz, NR OXOPYRROLIDINE FPR2 AGONISTS US Patent  US20230348426 Publication Date 11/2/2023 
Target
Name:
fMet-Leu-Phe receptor
Synonyms:
FPR FPR1_HUMAN N-formyl peptide receptor 1 fMLP receptor formyl peptide receptor 1
Type:
Enzyme Catalytic Domain
Mol. Mass.:
38456.14
Organism:
Homo sapiens (Human)
Description:
gi_4503779
Residue:
350
  
Inhibitor
Name:
BDBM631915
Synonyms:
US20230348426, Example 185
Type:
Small organic molecule
Emp. Form.:
C28H26F5N3O6
Mol. Mass.:
595.5146
SMILES:
COCCn1ccc(C)c(N2C[C@H]([C@H](NC(=O)c3ccc(OC(F)(F)F)cc3)C2=O)c2c(F)cc(OC)cc2F)c1=O
: