Target
fMet-Leu-Phe receptor
Ligand
BDBM632179
Substrate
Meas. Tech.
FPR2 and FPR1 Cyclic Adenosine Monophosphate (cAMP) Assays
EC50
0.200±n/a nM
Citation
 Shirude, PSRachamreddy, CRChattopadhyay, AKSeshadri, BBaligar, VMadduri, SRKick, EKWurtz, NR OXOPYRROLIDINE FPR2 AGONISTS US Patent  US20230348426 Publication Date 11/2/2023 
Target
Name:
fMet-Leu-Phe receptor
Synonyms:
FPR FPR1_HUMAN N-formyl peptide receptor 1 fMLP receptor formyl peptide receptor 1
Type:
Enzyme Catalytic Domain
Mol. Mass.:
38456.14
Organism:
Homo sapiens (Human)
Description:
gi_4503779
Residue:
350
  
Inhibitor
Name:
BDBM632179
Synonyms:
US20230348426, Example 449 US20230348426, Example 564
Type:
Small organic molecule
Emp. Form.:
C29H30F3N3O7
Mol. Mass.:
589.5596
SMILES:
COCC(CO)n1ccc(C)c(N2C[C@H]([C@H](NC(=O)c3ccc(OC(F)(F)F)cc3)C2=O)c2ccc(OC)cc2)c1=O
: