Target
Histone acetyltransferase KAT2B [719-832]
Ligand
BDBM311408
Substrate
Meas. Tech.
PCAF AlphaLisa Binding Assay
IC50
130±n/a nM
Citation
 Albrecht, BKCote, ACrawford, TDuplessis, MGood, ACLeBlanc, YMagnuson, SNasveschuk, CGPastor, RRomero, AFTaylor, AM Therapeutic compounds and uses thereof US Patent  US10155764 Publication Date 12/18/2018 
Target
Name:
Histone acetyltransferase KAT2B [719-832]
Synonyms:
KAT2B PCAF | PCAF (aa 719-832)
Type:
Enzyme Catalytic Domain
Mol. Mass.:
13623.13
Organism:
Homo sapiens (Human)
Description:
Q92831[719-832]
Residue:
114
  
Inhibitor
Name:
BDBM311408
Synonyms:
US10155764, Example 5
Type:
Small organic molecule
Emp. Form.:
C13H17FN4O
Mol. Mass.:
264.2987
SMILES:
CN(C)CCNc1nn(C)c(=O)c2cccc(F)c12
: