Target
Histone acetyltransferase KAT2B [719-832]
Ligand
BDBM311448
Substrate
Meas. Tech.
PCAF AlphaLisa Binding Assay
IC50
40.0±n/a nM
Citation
 Albrecht, BKCote, ACrawford, TDuplessis, MGood, ACLeBlanc, YMagnuson, SNasveschuk, CGPastor, RRomero, AFTaylor, AM Therapeutic compounds and uses thereof US Patent  US10155764 Publication Date 12/18/2018 
Target
Name:
Histone acetyltransferase KAT2B [719-832]
Synonyms:
KAT2B PCAF | PCAF (aa 719-832)
Type:
Enzyme Catalytic Domain
Mol. Mass.:
13623.13
Organism:
Homo sapiens (Human)
Description:
Q92831[719-832]
Residue:
114
  
Inhibitor
Name:
BDBM311448
Synonyms:
CHEM-US-00145 | US10155764, Example 34
Type:
Small organic molecule
Emp. Form.:
C22H26ClN5O
Mol. Mass.:
411.928
SMILES:
CN(C)[C@H]1CN(CC[C@@H]1Nc1nn(C)c(=O)c2ccccc12)c1ccc(Cl)cc1
: