Target
Histone acetyltransferase KAT2B [719-832]
Ligand
BDBM311482
Substrate
Meas. Tech.
PCAF AlphaLisa Binding Assay
IC50
63.0±n/a nM
Citation
 Albrecht, BKCote, ACrawford, TDuplessis, MGood, ACLeBlanc, YMagnuson, SNasveschuk, CGPastor, RRomero, AFTaylor, AM Therapeutic compounds and uses thereof US Patent  US10155764 Publication Date 12/18/2018 
Target
Name:
Histone acetyltransferase KAT2B [719-832]
Synonyms:
KAT2B PCAF | PCAF (aa 719-832)
Type:
Enzyme Catalytic Domain
Mol. Mass.:
13623.13
Organism:
Homo sapiens (Human)
Description:
Q92831[719-832]
Residue:
114
  
Inhibitor
Name:
BDBM311482
Synonyms:
CHEM-US-00188 | US10155764, Example 62
Type:
Small organic molecule
Emp. Form.:
C20H25N5O2
Mol. Mass.:
367.4448
SMILES:
COc1ccc(cn1)[C@@H]([C@H](C)Nc1nn(C)c(=O)c2ccccc12)N(C)C
: