Target
Histone acetyltransferase KAT2B [719-832]
Ligand
BDBM311498
Substrate
Meas. Tech.
PCAF AlphaLisa Binding Assay
IC50
20.0±n/a nM
Citation
 Albrecht, BKCote, ACrawford, TDuplessis, MGood, ACLeBlanc, YMagnuson, SNasveschuk, CGPastor, RRomero, AFTaylor, AM Therapeutic compounds and uses thereof US Patent  US10155764 Publication Date 12/18/2018 
Target
Name:
Histone acetyltransferase KAT2B [719-832]
Synonyms:
KAT2B PCAF | PCAF (aa 719-832)
Type:
Enzyme Catalytic Domain
Mol. Mass.:
13623.13
Organism:
Homo sapiens (Human)
Description:
Q92831[719-832]
Residue:
114
  
Inhibitor
Name:
BDBM311498
Synonyms:
CHEM-US-00210 | US10155764, Example 74A
Type:
Small organic molecule
Emp. Form.:
C25H27N5O3S
Mol. Mass.:
477.579
SMILES:
C[C@H](Nc1nn(C)c(=O)c2cccnc12)[C@@H](N(C)C)c1ccc(cc1)S(=O)(=O)c1ccccc1
: