Target
Histone acetyltransferase KAT2B [719-832]
Ligand
BDBM311500
Substrate
Meas. Tech.
PCAF AlphaLisa Binding Assay
IC50
130±n/a nM
Citation
 Albrecht, BKCote, ACrawford, TDuplessis, MGood, ACLeBlanc, YMagnuson, SNasveschuk, CGPastor, RRomero, AFTaylor, AM Therapeutic compounds and uses thereof US Patent  US10155764 Publication Date 12/18/2018 
Target
Name:
Histone acetyltransferase KAT2B [719-832]
Synonyms:
KAT2B PCAF | PCAF (aa 719-832)
Type:
Enzyme Catalytic Domain
Mol. Mass.:
13623.13
Organism:
Homo sapiens (Human)
Description:
Q92831[719-832]
Residue:
114
  
Inhibitor
Name:
BDBM311500
Synonyms:
CHEM-US-00212 | US10155764, Example 75
Type:
Small organic molecule
Emp. Form.:
C16H22N8O
Mol. Mass.:
342.3989
SMILES:
CC(Nc1nn(C)c(=O)c2cccnc12)C(N(C)C)c1cn(C)nn1
: