Target
Proto-oncogene tyrosine-protein kinase receptor Ret [658-1114,V804M]
Ligand
BDBM524654
Substrate
IC50
5.80±n/a nM
Citation
 Andrews, SWBlake, JFHaas, JJiang, YKolakowski, GRMoreno, DARen, LWalls, SM Substituted pyrazolo[1,5-A]pyrazine compounds as ret kinase inhibitors US Patent  US11851434 Publication Date 12/26/2023 
Target
Name:
Proto-oncogene tyrosine-protein kinase receptor Ret [658-1114,V804M]
Synonyms:
CDHF12 PTC Proto-oncogene tyrosine-protein kinase receptor Ret (V804M) RET Kinase (V804M) (aa658-end) RET_HUMAN
Type:
Enzyme Catalytic Domain
Mol. Mass.:
51567.23
Organism:
Homo sapiens (Human)
Description:
P07949[658-1114,V804M]
Residue:
457
  
Inhibitor
Name:
BDBM524654
Synonyms:
US11168090, Example 98 | US11851434, Example 98
Type:
Small organic molecule
Emp. Form.:
C26H23N9O
Mol. Mass.:
477.5205
SMILES:
Cn1cc(cn1)-c1cn2ncc(C#N)c2c(n1)-c1ccc(nc1)N1CCC(CC1)Oc1ccccn1
: