Target
Cyclin-T1/Cyclin-dependent kinase 9
Ligand
BDBM642572
Substrate
Meas. Tech.
Enzyme Activity Assay of CDK9 Protein Inhibition In Vitro
IC50
0.900±n/a nM
Citation
 LIU, QLIU, JWU, YWANG, BWANG, AHU, CLIU, QZOU, FWANG, WWANG, ZCAO, JSHI, CWANG, L DIHYDROISOQUINOLINONE AND ISOINDOLINONE DERIVATIVES AND USES THEREOF US Patent  US20230416221 Publication Date 12/28/2023 
Target
Name:
Cyclin-T1/Cyclin-dependent kinase 9
Synonyms:
CDK9/ Cyclin-T1 CDK9/Cyclin T Cyclin T1/dependent kinase 9 | Cyclin-Dependent Kinase 9 (CDK9)
Type:
Protein Complex
Mol. Mass.:
Description:
Components:
This complex has 2 components.
Component 1
Name:
Cyclin-T1
Synonyms:
CCNT1 CycT Cyclin T Cyclin-T
Type:
Enzyme Subunit
Mol. Mass.:
80712.40
Organism:
Homo sapiens (Human)
Description:
Residue:
726
  
Component 2
Name:
Cyclin-dependent kinase 9
Synonyms:
C-2K CDK9 Cell division cycle 2-like protein kinase 4 Cyclin-Dependent Kinase 9 (CDK9) Serine/threonine-protein kinase PITALRE Tat-associated kinase complex catalytic subunit
Type:
Enzyme Subunit
Mol. Mass.:
42789.13
Organism:
Homo sapiens (Human)
Description:
Residue:
372
  
Inhibitor
Name:
BDBM642572
Synonyms:
US20230416221, Compound 104
Type:
Small organic molecule
Emp. Form.:
C21H27N5O3S
Mol. Mass.:
429.536
SMILES:
CC1(C)CNC(=O)c2ccc(cc12)-c1ccnc(N[C@@H]2CCCN(C2)S(C)(=O)=O)n1
: