Target
Cyclin-A2/Cyclin-dependent kinase 2
Ligand
BDBM642775
Substrate
Meas. Tech.
Kinase Activity Assay
IC50
0.200±n/a nM
Citation
 Cheng, HXiong, WNiu, WYu, BJiang, Y HETEROARYLQUINAZOLINE COMPOUNDS AS PROTEIN KINASE INHIBITORS US Patent  US20230416271 Publication Date 12/28/2023 
Target
Name:
Cyclin-A2/Cyclin-dependent kinase 2
Synonyms:
CDK2-CyclinA CDK2/Cyclin A Cyclin A2/dependent kinase 2 Cyclin-Dependent Kinase 2 (CDK2A)
Type:
Protein Complex
Mol. Mass.:
Description:
Cdk2/Cyclin A kinase was purified from insect cells coinfected with Cyclin A/Cdk2 baculovirus.
Components:
This complex has 2 components.
Component 1
Name:
Cyclin-dependent kinase 2
Synonyms:
CDK2 CDK2_HUMAN Cell division protein kinase 2 Protein cereblon/Cyclin-dependent kinase 2 | p33 protein kinase
Type:
Enzyme Subunit
Mol. Mass.:
33938.17
Organism:
Homo sapiens (Human)
Description:
P24941
Residue:
298
  
Component 2
Name:
Cyclin-A2
Synonyms:
CCN1 CCNA1 CCNA2_HUMAN Cyclin-A
Type:
Enzyme Subunit
Mol. Mass.:
48550.19
Organism:
Homo sapiens (Human)
Description:
P20248
Residue:
432
  
Inhibitor
Name:
BDBM642775
Synonyms:
N-(1-(cyclopropylsulfonyl)piperidin-4-yl)-4-(difluoromethyl)-1- isopropyl-1H-[1,2,3]triazolo[4,5-h]quinazolin-8-amine | US20230416271, Compound II.29
Type:
Small organic molecule
Emp. Form.:
C20H25F2N7O2S
Mol. Mass.:
465.52
SMILES:
CC(C)n1nnc2c(cc3cnc(NC4CCN(CC4)S(=O)(=O)C4CC4)nc3c12)C(F)F
: