Target
Monoacylglycerol lipase ABHD6 [33-337]
Ligand
BDBM645019
Substrate
Meas. Tech.
Evaluation of ABHD6 Enzyme Inhibitory Activity Assay
IC50
2.00±n/a nM
Citation
 YOSHIDA, AHYAKUTAKE, RNAGASHIMA, NMISU, RMORI, S ABHD6 ANTAGONIST US Patent  US20240010658 Publication Date 1/11/2024 
Target
Name:
Monoacylglycerol lipase ABHD6 [33-337]
Synonyms:
Monoacylglycerol lipase ABHD6 (33-337)
Type:
Enzyme
Mol. Mass.:
34939.75
Organism:
Homo sapiens (Human)
Description:
Q9BV23[33-337]
Residue:
305
  
Inhibitor
Name:
BDBM645019
Synonyms:
US20240010658, Example 2-14
Type:
Small organic molecule
Emp. Form.:
C20H27BrN4O
Mol. Mass.:
419.359
SMILES:
Brc1ccc(N[C@@H]2CC[C@H]3CN(C[C@@H]23)C(=O)C2CC3CCC2CC3)nn1
: