Target
Monoacylglycerol lipase ABHD6 [33-337]
Ligand
BDBM645030
Substrate
Meas. Tech.
Evaluation of ABHD6 Enzyme Inhibitory Activity Assay
IC50
1.000±n/a nM
Citation
 YOSHIDA, AHYAKUTAKE, RNAGASHIMA, NMISU, RMORI, S ABHD6 ANTAGONIST US Patent  US20240010658 Publication Date 1/11/2024 
Target
Name:
Monoacylglycerol lipase ABHD6 [33-337]
Synonyms:
Monoacylglycerol lipase ABHD6 (33-337)
Type:
Enzyme
Mol. Mass.:
34939.75
Organism:
Homo sapiens (Human)
Description:
Q9BV23[33-337]
Residue:
305
  
Inhibitor
Name:
BDBM645030
Synonyms:
US20240010658, Example 12
Type:
Small organic molecule
Emp. Form.:
C19H20ClFN4O2S
Mol. Mass.:
422.904
SMILES:
F[C@@]12CN(C[C@@H]1CC[C@H]2Nc1ccc(Cl)nn1)C(=O)c1cc2COCCc2s1
: