Target
Monoacylglycerol lipase ABHD6 [33-337]
Ligand
BDBM645032
Substrate
Meas. Tech.
Evaluation of ABHD6 Enzyme Inhibitory Activity Assay
IC50
1.000±n/a nM
Citation
 YOSHIDA, AHYAKUTAKE, RNAGASHIMA, NMISU, RMORI, S ABHD6 ANTAGONIST US Patent  US20240010658 Publication Date 1/11/2024 
Target
Name:
Monoacylglycerol lipase ABHD6 [33-337]
Synonyms:
Monoacylglycerol lipase ABHD6 (33-337)
Type:
Enzyme
Mol. Mass.:
34939.75
Organism:
Homo sapiens (Human)
Description:
Q9BV23[33-337]
Residue:
305
  
Inhibitor
Name:
BDBM645032
Synonyms:
US20240010658, Example 16
Type:
Small organic molecule
Emp. Form.:
C19H19BrF2N4O2S
Mol. Mass.:
485.346
SMILES:
FC1(F)C[C@@H](Nc2ccc(Br)nn2)[C@@H]2CN(C[C@H]12)C(=O)c1cc2COCCc2s1
: