Target
Dimer of Gag-Pol polyprotein [489-587]
Ligand
BDBM9622
Substrate
Biotinylated HIV-1 Protease Peptide Substrate
Meas. Tech.
Protease Inhibition Assay
IC50
14.7±n/a nM
Citation
 Jungheim, LNShepherd, TABaxter, AJBurgess, JHatch, SDLubbehusen, PWiskerchen, MMuesing, MA Potent human immunodeficiency virus type 1 protease inhibitors that utilize noncoded D-amino acids as P2/P3 ligands. J Med Chem 39:96-108 (1996)  
Target
Name:
Dimer of Gag-Pol polyprotein [489-587]
Synonyms:
HIV-1 Protease
Type:
Protein Complex
Mol. Mass.:
Description:
Components:
This complex has 2 components.
Component 1
Name:
Gag-Pol polyprotein [489-587]
Synonyms:
HIV protease HIV-1 Protease chain A POL_HV1N5 | gag-pol
Type:
Enzyme Subunit
Mol. Mass.:
10822.21
Organism:
Human immunodeficiency virus type 1
Description:
P12497[489-587]
Residue:
99
  
Component 2
Name:
Gag-Pol polyprotein [489-587]
Synonyms:
HIV protease HIV-1 Protease chain A POL_HV1N5 | gag-pol
Type:
Enzyme Subunit
Mol. Mass.:
10822.21
Organism:
Human immunodeficiency virus type 1
Description:
P12497[489-587]
Residue:
99
  
Inhibitor
Name:
BDBM9622
Synonyms:
(S)-N-(1S,2R)-[3-[2-[[(1,1-Dimethylethyl)amino]carbonyl]phenyl]-2-hydroxy-1-(phenylmethyl)-propyl]-2-(methylsulfonyl)amino]-3-(benzylthio)propanamide D-Cysteine Analog 16a
Type:
Small organic molecule
Emp. Form.:
C32H41N3O5S2
Mol. Mass.:
611.815
SMILES:
CC(C)(C)NC(=O)c1ccccc1C[C@@H](O)[C@H](Cc1ccccc1)NC(=O)[C@@H](CSCc1ccccc1)NS(C)(=O)=O
:
Substrate
Name:
Biotinylated HIV-1 Protease Peptide Substrate
Synonyms:
Type:
Peptide
Mol. Mass.:
2106.93
Organism:
Description:
Residue:
19
ITINGSQNYPIVGKFITCH