Target
Dimer of Gag-Pol polyprotein [489-587]
Ligand
BDBM9632
Substrate
Biotinylated HIV-1 Protease Peptide Substrate
Meas. Tech.
Protease Inhibition Assay
IC50
3.5±n/a nM
Citation
 Jungheim, LNShepherd, TABaxter, AJBurgess, JHatch, SDLubbehusen, PWiskerchen, MMuesing, MA Potent human immunodeficiency virus type 1 protease inhibitors that utilize noncoded D-amino acids as P2/P3 ligands. J Med Chem 39:96-108 (1996)  
Target
Name:
Dimer of Gag-Pol polyprotein [489-587]
Synonyms:
HIV-1 Protease
Type:
Protein Complex
Mol. Mass.:
Description:
Components:
This complex has 2 components.
Component 1
Name:
Gag-Pol polyprotein [489-587]
Synonyms:
HIV protease HIV-1 Protease chain A POL_HV1N5 | gag-pol
Type:
Enzyme Subunit
Mol. Mass.:
10822.21
Organism:
Human immunodeficiency virus type 1
Description:
P12497[489-587]
Residue:
99
  
Component 2
Name:
Gag-Pol polyprotein [489-587]
Synonyms:
HIV protease HIV-1 Protease chain A POL_HV1N5 | gag-pol
Type:
Enzyme Subunit
Mol. Mass.:
10822.21
Organism:
Human immunodeficiency virus type 1
Description:
P12497[489-587]
Residue:
99
  
Inhibitor
Name:
BDBM9632
Synonyms:
(S)-N-(1S,2R)-[3-[2-[[(1,1-Dimethylethyl)amino]carbonyl]phenyl]-2-hydroxy-1-(phenylmethyl)-propyl]-2-[(methylsulfonyl)amino]-3-(2-naphthylsulfinyl)-propanamide N-tert-butyl-2-[(2R,3S)-2-hydroxy-3-[(2S)-2-methanesulfonamido-3-(naphthalene-2-sulfinyl)propanamido]-4-phenylbutyl]benzamide
Type:
Small organic molecule
Emp. Form.:
C35H41N3O6S2
Mol. Mass.:
663.847
SMILES:
CC(C)(C)NC(=O)c1ccccc1C[C@@H](O)[C@H](Cc1ccccc1)NC(=O)[C@@H](CS(=O)c1ccc2ccccc2c1)NS(C)(=O)=O
:
Substrate
Name:
Biotinylated HIV-1 Protease Peptide Substrate
Synonyms:
Type:
Peptide
Mol. Mass.:
2106.93
Organism:
Description:
Residue:
19
ITINGSQNYPIVGKFITCH