Target
Serine/threonine-protein kinase SIK2
Ligand
BDBM647305
Substrate
Meas. Tech.
In Vitro SIK2 Kinase Assay
IC50
4.90±n/a nM
Citation
 Wein, MNGreenlee, WJ SALT INDUCIBLE KINASE INHIBITORS US Patent  US20240025892 Publication Date 1/25/2024 
Target
Name:
Serine/threonine-protein kinase SIK2
Synonyms:
KIAA0781 SIK2 SNF1LK2 Serine/threonine-protein kinase SIK2
Type:
Protein
Mol. Mass.:
103906.53
Organism:
Homo sapiens (Human)
Description:
Residue:
926
  
Inhibitor
Name:
BDBM647305
Synonyms:
US20240025892, Example 12
Type:
Small organic molecule
Emp. Form.:
C31H37N5O3
Mol. Mass.:
527.6572
SMILES:
COCCN1CCC11CCN(CC1)c1cccc2ccc(nc12)-n1cnc2cc(OCC3(C)COC3)ccc12
: