Target
Serine/threonine-protein kinase SIK2
Ligand
BDBM647306
Substrate
Meas. Tech.
In Vitro SIK2 Kinase Assay
IC50
4.19±n/a nM
Citation
 Wein, MNGreenlee, WJ SALT INDUCIBLE KINASE INHIBITORS US Patent  US20240025892 Publication Date 1/25/2024 
Target
Name:
Serine/threonine-protein kinase SIK2
Synonyms:
KIAA0781 SIK2 SNF1LK2 Serine/threonine-protein kinase SIK2
Type:
Protein
Mol. Mass.:
103906.53
Organism:
Homo sapiens (Human)
Description:
Residue:
926
  
Inhibitor
Name:
BDBM647306
Synonyms:
US20240025892, Example 13
Type:
Small organic molecule
Emp. Form.:
C26H29N5O2
Mol. Mass.:
443.5408
SMILES:
CC1(COc2ccn3c(cnc3c2)-c2ccc3cccc(N4CCC(N)CC4)c3n2)COC1
: