Target
Serine/threonine-protein kinase SIK2
Ligand
BDBM647341
Substrate
Meas. Tech.
In Vitro SIK2 Kinase Assay
IC50
7.65±n/a nM
Citation
 Wein, MNGreenlee, WJ SALT INDUCIBLE KINASE INHIBITORS US Patent  US20240025892 Publication Date 1/25/2024 
Target
Name:
Serine/threonine-protein kinase SIK2
Synonyms:
KIAA0781 SIK2 SNF1LK2 Serine/threonine-protein kinase SIK2
Type:
Protein
Mol. Mass.:
103906.53
Organism:
Homo sapiens (Human)
Description:
Residue:
926
  
Inhibitor
Name:
BDBM647341
Synonyms:
US20240025892, Example 48
Type:
Small organic molecule
Emp. Form.:
C20H15N5
Mol. Mass.:
325.3666
SMILES:
N#Cc1ccc(cc1)-c1cnc2cc(ccn12)-n1cnc(c1)C1CC1
: