Target
Serine/threonine-protein kinase SIK2
Ligand
BDBM647354
Substrate
Meas. Tech.
In Vitro SIK2 Kinase Assay
IC50
3.07±n/a nM
Citation
 Wein, MNGreenlee, WJ SALT INDUCIBLE KINASE INHIBITORS US Patent  US20240025892 Publication Date 1/25/2024 
Target
Name:
Serine/threonine-protein kinase SIK2
Synonyms:
KIAA0781 SIK2 SNF1LK2 Serine/threonine-protein kinase SIK2
Type:
Protein
Mol. Mass.:
103906.53
Organism:
Homo sapiens (Human)
Description:
Residue:
926
  
Inhibitor
Name:
BDBM647354
Synonyms:
US20240025892, Example 61
Type:
Small organic molecule
Emp. Form.:
C23H22N6O3
Mol. Mass.:
430.4592
SMILES:
CCc1nc(no1)-c1c(OC)cc(cc1OC)-c1cnc2cc(ccn12)-c1cnn(C)c1
: