Target
Bromodomain-containing protein 3 [326-398]
Ligand
BDBM186322
Substrate
Meas. Tech.
FP Competitive Binding Assay (No.350)
Temperature
298.15±n/a K
Ki
406±192 nM
Comments
extracted
Citation
 Wang, SRan, XZhao, YYang, CLiu, LBai, LMcEachern, DStuckey, JMeagher, JLSun, DLi, XZhou, BKaratas, HLuo, RChinnaiyan, AAsangani, IA BET bromodomain inhibitors and therapeutic methods using the same US Patent  US9675697 Publication Date 6/13/2017 
Target
Name:
Bromodomain-containing protein 3 [326-398]
Synonyms:
BRD3 Bromodomain-containing protein 3 (BRD3)(BD2) KIAA0043 | RING3L
Type:
Mol. Mass.:
8553.07
Organism:
Homo sapiens (Human)
Description:
BD2 (326-398 aa) of Q15059
Residue:
73
  
Inhibitor
Name:
BDBM186322
Synonyms:
US9675697, RX-39
Type:
Emp. Form.:
C18H16ClN3O2
Mol. Mass.:
341.792
SMILES:
CCc1noc(C)c1-c1cc2[nH]c3ccnc(Cl)c3c2cc1OC
: