Target
Bromodomain-containing protein 4 [75-147]
Ligand
BDBM179481
Substrate
Meas. Tech.
FP Competitive Binding Assay (No.350)
Temperature
298.15±n/a K
Ki
35±n/a nM
Comments
extracted
Citation
 Wang, SRan, XZhao, YYang, CLiu, LBai, LMcEachern, DStuckey, JMeagher, JLSun, DLi, XZhou, BKaratas, HLuo, RChinnaiyan, AAsangani, IA BET bromodomain inhibitors and therapeutic methods using the same US Patent  US9675697 Publication Date 6/13/2017 
Target
Name:
Bromodomain-containing protein 4 [75-147]
Synonyms:
BRD4 Bromo domain 1 Bromodomain-containing protein 4 (BRD4) Bromo 1 Bromodomain-containing protein 4 (BRD4)(Bromo 1) Bromodomain-containing protein 4 Bromodomain 1 (BRD4-1) HUNK1
Type:
Mol. Mass.:
8856.55
Organism:
Homo sapiens (Human)
Description:
BD1 (75-147 aa) of O60885
Residue:
73
  
Inhibitor
Name:
BDBM179481
Synonyms:
US9675697, Cpd. No. 73
Type:
Small organic molecule
Emp. Form.:
C26H21N5O2
Mol. Mass.:
435.4772
SMILES:
COc1cc2c(cc1-c1c(C)noc1C)[nH]c1nc(C)nc(-c3ccnc4ccccc34)c21
: