Target
Genome polyprotein
Ligand
BDBM9756
Substrate
NS3-NS4A Chromogenic Peptide Substrate
Meas. Tech.
Continuous Spectrophotometric Assay
pH
6.5±n/a
Temperature
303.15±n/a K
Ki
41±n/a nM
Km
19000±1000 nM
Comments
The substrate is hydrolyzed by HCV protease with a second-order rate constant (kcat/Km) of 80,000 +/- 10,000 M-1sec-1.
Citation
 Venkatraman, SNjoroge, FGWu, WGirijavallabhan, VProngay, AJButkiewicz, NPichardo, J Novel inhibitors of hepatitis C NS3-NS4A serine protease derived from 2-aza-bicyclo[2.2.1]heptane-3-carboxylic acid. Bioorg Med Chem Lett 16:1628-32 (2006)  
Target
Name:
Genome polyprotein
Synonyms:
Dipeptidyl peptidase 4 (DPP4) NS3 NS5B NS3-4A Protease NS3/4A protease POLG_HCV77 | RNA polymerase (NS5B)
Type:
Protease Domain
Mol. Mass.:
327221.49
Organism:
Hepatitis C virus (HCV genotype 1a, isolate H)
Description:
P27958
Residue:
3011
  
Inhibitor
Name:
BDBM9756
Synonyms:
2-aza-bicyclo[2.2.1]heptane-3-carboxylic acid deriv. 27 | tert-butyl N-[(1S)-1-cyclohexyl-2-[(3S)-3-({1-[({[(S)-(dimethylcarbamoyl)(phenyl)methyl]carbamoyl}methyl)carbamoyl]-1-oxohexan-2-yl}carbamoyl)-2-azabicyclo[2.2.1]heptan-2-yl]-2-oxoethyl]carbamate
Type:
Small organic molecule
Emp. Form.:
C39H58N6O8
Mol. Mass.:
738.9132
SMILES:
CCCCC(NC(=O)[C@@H]1C2CCC(C2)N1C(=O)[C@@H](NC(=O)OC(C)(C)C)C1CCCCC1)C(=O)C(=O)NCC(=O)N[C@H](C(=O)N(C)C)c1ccccc1
:
Substrate
Name:
NS3-NS4A Chromogenic Peptide Substrate
Synonyms:
Type:
Peptide
Mol. Mass.:
1366.94
Organism:
Description:
The 4-phenylazophenol (PAP) chromophore was incorporated to improve assay sensitivity.
Residue:
13
ACDTEDVVPNVAH