Target
Sigma non-opioid intracellular receptor 1
Ligand
BDBM312231
Substrate
Meas. Tech.
Receptor Assay
Ki
8.94±1.64 nM
Citation
 McCurdy, CRMesangeau, CChin, FTJames, MLShen, BGambhir, S Highly selective sigma receptor radioligands US Patent  US9604926 Publication Date 3/28/2017 
Target
Name:
Sigma non-opioid intracellular receptor 1
Synonyms:
Opioid receptor, sigma 1 SGMR1_MOUSE Sigma1-receptor Sigmar1
Type:
Enzyme Catalytic Domain
Mol. Mass.:
25246.51
Organism:
Mus musculus (Mouse)
Description:
O55242
Residue:
223
  
Inhibitor
Name:
BDBM312231
Synonyms:
US9604926, Compound AZ-59 | US9724435, Compound AZ-59
Type:
Small organic molecule
Emp. Form.:
C22H33N3S2
Mol. Mass.:
403.648
SMILES:
CC(CCCn1c2ccccc2sc1=S)N1CCN(CC1)C1CCCCC1
: