Target
Lysine-specific histone demethylase 1A
Ligand
BDBM179984
Substrate
Meas. Tech.
LSD1 Assay
pH
7.4±n/a
Temperature
298.15±n/a K
Ki
50±n/a nM
Comments
extracted
Citation
 Fyfe, MCOrtega Muñoz, ACastro-Palomino Laria, JMartinell Pedemonte, MEstiarte-Martinez, MValls Vidal, N Cyclopropylamine derivatives useful as LSD1 inhibitors US Patent  US9676701 Publication Date 6/13/2017 
Target
Name:
Lysine-specific histone demethylase 1A
Synonyms:
AOF2 Flavin-containing amine oxidase domain-containing protein 2 KDM1A KIAA0601 Lysine-specific demethylase 1 (LSD1) Lysine-specific histone demethylase 1 (LSD1)
Type:
Enzyme
Mol. Mass.:
92901.01
Organism:
Homo sapiens (Human)
Description:
O60341
Residue:
852
  
Inhibitor
Name:
BDBM179984
Synonyms:
US9676701, 124 N-(3-(5-((trans)-2-aminocyclopropyl)thiazol-2-yl)phenyl)-2-cyanobenzenesulfonamide dihydrochloride
Type:
Small organic molecule
Emp. Form.:
C19H16N4O2S2
Mol. Mass.:
396.486
SMILES:
N[C@H]1C[C@@H]1c1cnc(s1)-c1cccc(NS(=O)(=O)c2ccccc2C#N)c1
: