Target
Nucleoprotein
Ligand
BDBM614536
Substrate
Meas. Tech.
TBD
EC50
93.0±n/a nM
Citation
 BARRETT, MCOCKERILL, GSGOOD, JAVERY, CACOCHRANE, EJJONES, SPONIONS, STWARNER, AJ BENZODIAZEPINE DERIVATIVES USEFUL IN TREATING A RESPIRATORY SYNCYTIAL VIRUS INFECTION US Patent  US20230270751 Publication Date 8/31/2023 
Target
Name:
Nucleoprotein
Synonyms:
N Nucleocapsid protein | Protein N
Type:
PROTEIN
Mol. Mass.:
43455.45
Organism:
Human respiratory syncytial virus A (strain A2)
Description:
ChEMBL_117398
Residue:
391
  
Inhibitor
Name:
BDBM614536
Synonyms:
US20230270751, Example 107 | tert-butyl N-[3- [[(3S)-9-fluoro-2- oxo-5-phenyl-1,3- dihydro-1,4- benzodiazepin-3- yl]carbamoyl]-2-(2- fluorophenyl)-6,7- dihydro-5H- pyrazolo[5,1- b][1,3]oxazin-6-yl]- N-methylcarbamate
Type:
Small organic molecule
Emp. Form.:
C34H32F2N6O5
Mol. Mass.:
642.6519
SMILES:
CN(C1COc2c(C(=O)N[C@H]3N=C(c4ccccc4)c4cccc(F)c4NC3=O)c(nn2C1)-c1ccccc1F)C(=O)OC(C)(C)C
: