Target
Inhibitor of nuclear factor kappa-B kinase subunit beta
Ligand
BDBM312816
Substrate
Meas. Tech.
NIK Enzyme Inhibition Assay
Ki
0.050±n/a nM
Citation
 Blaquiere, NCastanedo, GFeng, JAHu, BStaben, SYuen, PWu, GBurch, J Alkynyl alcohols and methods of use US Patent  US9605005 Publication Date 3/28/2017 
Target
Name:
Inhibitor of nuclear factor kappa-B kinase subunit beta
Synonyms:
I-kappa-B Kinase 2 (IKK-beta) I-kappa-B-kinase beta IKBKB IKK-beta IKK2/IKK1 IKKB_HUMAN Inhibitor of nuclear factor kappa B kinase beta subunit Nuclear factor NF-kappa-B inhibitor kinase beta
Type:
Serine/threonine-protein kinase
Mol. Mass.:
86554.39
Organism:
Homo sapiens (Human)
Description:
GST-tagged IKK-2 was expressed in High Five cells and purified.
Residue:
756
  
Inhibitor
Name:
BDBM312816
Synonyms:
1-[3-[2-[(3R)-3-hydroxy-1- methyl-2-oxo-pyrrolidin-3- yl]ethynyl]phenyl]-5-(4-meth- ylimidazol-1-yl)indazole- 3-carboxamide | US9605005, Example 106
Type:
Small organic molecule
Emp. Form.:
C25H22N6O3
Mol. Mass.:
454.4806
SMILES:
CN1CC[C@@](O)(C#Cc2cccc(c2)-n2nc(C(N)=O)c3cc(ccc23)-n2cnc(C)c2)C1=O
: